BDBM50359063 CHEMBL1922643
SMILES CCc1ccc(COc2ccc3n(Cc4ccc(cc4)-c4ccc(OC)nc4)c(CC(C)(C)C(O)=O)c(SC(C)(C)C)c3c2)nc1
InChI Key InChIKey=VLYGYKJKEWIQAN-UHFFFAOYSA-N
Data  4 IC50
  Tab Delimited (TSV)   2D SDfile   Computed 3D by Vconf -m prep SDfile
Find this compound or compounds like it in BindingDB:
Activity Spreadsheet -- Enzyme Inhibition Constant Data from BindingDB
Found 4 hits for monomerid = 50359063
TargetArachidonate 5-lipoxygenase-activating protein(Homo sapiens (Human))
Amira Pharmaceuticals
Curated by ChEMBL
LigandPNGBDBM50359063(CHEMBL1922643)
Affinity DataIC50:  1.39E+3nM. Assay description: Inhibition of FLAP in human whole blood assessed as inhibition of calcium ionophore A23187-induced LTB4 production preincubated for 5 hrs by ELISA
In DepthDetails ArticlePubMed
TargetArachidonate 5-lipoxygenase-activating protein(Homo sapiens (Human))
Amira Pharmaceuticals
Curated by ChEMBL
LigandPNGBDBM50359063(CHEMBL1922643)
Affinity DataIC50:  10nM. Assay description: Displacement of [3H]-3-[5-(pyrid-2-ylmethoxy)-3-tert-butylthio-1-benzylindol-2-yl]-2,2-dimethylpropionic acid from FLAP in human polymorphonuclear ce...
In DepthDetails ArticlePubMed
TargetArachidonate 5-lipoxygenase-activating protein(Homo sapiens (Human))
Amira Pharmaceuticals
Curated by ChEMBL
LigandPNGBDBM50359063(CHEMBL1922643)
Affinity DataIC50:  0.600nM. Assay description: Inhibition of FLAP in human peripheral leukocytes assessed as inhibition of calcium ionophore A23187-induced LTB4 production after 10 mins by ELISA
In DepthDetails ArticlePubMed
TargetArachidonate 5-lipoxygenase-activating protein(Homo sapiens (Human))
Amira Pharmaceuticals
Curated by ChEMBL
LigandPNGBDBM50359063(CHEMBL1922643)
Affinity DataIC50:  1.20E+3nM. Assay description: Inhibition of FLAP in human whole blood assessed as inhibition of calcium ionophore A23187-induced LTB4 production preincubated for 15 mins by ELISA
In DepthDetails ArticlePubMed