BDBM50359742 CHEMBL1928126
SMILES COc1ccccc1N1CCN(CCCCNC(=O)c2ccc(COCCOCCOCCOCCOCc3ccc(cc3)C(=O)NCCCCN3CCN(CC3)c3ccccc3OC)cc2)CC1
InChI Key InChIKey=BYUVKVSQQDHYKB-UHFFFAOYSA-N
Data  5 KI
  Tab Delimited (TSV)   2D SDfile   Computed 3D by Vconf -m prep SDfile
Find this compound or compounds like it in BindingDB:
Activity Spreadsheet -- Enzyme Inhibition Constant Data from BindingDB
Found 5 hits for monomerid = 50359742
TargetD(3) dopamine receptor(Homo sapiens (Human))
Friedrich-Alexander University
Curated by ChEMBL
LigandPNGBDBM50359742(CHEMBL1928126)
Affinity DataKi:  0.880nM. Assay description: Displacement of [3H]spiperone from human D3 receptor expressed in CHO cells
In DepthDetails ArticlePubMed
TargetAlpha-1A adrenergic receptor(Sus scrofa)
Friedrich-Alexander University
Curated by ChEMBL
LigandPNGBDBM50359742(CHEMBL1928126)
Affinity DataKi:  1.10nM. Assay description: Displacement of [3H]prazosin from pig adrenergic alpha1 receptor in cerebral cortex homogenate
In DepthDetails ArticlePubMed
TargetD(2) dopamine receptor(Homo sapiens (Human))
Friedrich-Alexander University
Curated by ChEMBL
LigandPNGBDBM50359742(CHEMBL1928126)
Affinity DataKi:  11nM. Assay description: Displacement of [3H]spiperone from human D2 short receptor expressed in CHO cells
In DepthDetails ArticlePubMed
TargetD(2) dopamine receptor(Homo sapiens (Human))
Friedrich-Alexander University
Curated by ChEMBL
LigandPNGBDBM50359742(CHEMBL1928126)
Affinity DataKi:  25nM. Assay description: Displacement of [3H]spiperone from human D2 long receptor expressed in CHO cells
In DepthDetails ArticlePubMed
TargetD(1A) dopamine receptor(Sus scrofa)
Friedrich-Alexander University
Curated by ChEMBL
LigandPNGBDBM50359742(CHEMBL1928126)
Affinity DataKi:  540nM. Assay description: Displacement of [3H]SCH23390 from pig D1 receptor in straital membrane
In DepthDetails ArticlePubMed