BDBM50359748 CHEMBL1928131
SMILES COc1ccccc1N1CCN(CCCNC(=O)c2ccc(COCCOCCOCCOCCOCCOCCOCCOCCOCc3ccc(cc3)C(=O)NCCCN3CCN(CC3)c3ccccc3OC)cc2)CC1
InChI Key InChIKey=FKPUMTSFODZMAY-UHFFFAOYSA-N
Data  5 KI
  Tab Delimited (TSV)   2D SDfile   Computed 3D by Vconf -m prep SDfile
Find this compound or compounds like it in BindingDB:
Activity Spreadsheet -- Enzyme Inhibition Constant Data from BindingDB
Found 5 hits for monomerid = 50359748
TargetAlpha-1A adrenergic receptor(Sus scrofa)
Friedrich-Alexander University
Curated by ChEMBL
LigandPNGBDBM50359748(CHEMBL1928131)
Affinity DataKi:  8.90nM. Assay description: Displacement of [3H]prazosin from pig adrenergic alpha1 receptor in cerebral cortex homogenate
In DepthDetails ArticlePubMed
TargetD(2) dopamine receptor(Homo sapiens (Human))
Friedrich-Alexander University
Curated by ChEMBL
LigandPNGBDBM50359748(CHEMBL1928131)
Affinity DataKi:  66nM. Assay description: Displacement of [3H]spiperone from human D2 short receptor expressed in CHO cells
In DepthDetails ArticlePubMed
TargetD(2) dopamine receptor(Homo sapiens (Human))
Friedrich-Alexander University
Curated by ChEMBL
LigandPNGBDBM50359748(CHEMBL1928131)
Affinity DataKi:  150nM. Assay description: Displacement of [3H]spiperone from human D2 long receptor expressed in CHO cells
In DepthDetails ArticlePubMed
TargetD(3) dopamine receptor(Homo sapiens (Human))
Friedrich-Alexander University
Curated by ChEMBL
LigandPNGBDBM50359748(CHEMBL1928131)
Affinity DataKi:  350nM. Assay description: Displacement of [3H]spiperone from human D3 receptor expressed in CHO cells
In DepthDetails ArticlePubMed
TargetD(1A) dopamine receptor(Sus scrofa)
Friedrich-Alexander University
Curated by ChEMBL
LigandPNGBDBM50359748(CHEMBL1928131)
Affinity DataKi:  1.80E+3nM. Assay description: Displacement of [3H]SCH23390 from pig D1 receptor in straital membrane
In DepthDetails ArticlePubMed