BDBM50362 2-[2-[3-(2-furanyl)-5-(4-methoxyphenyl)-3,4-dihydropyrazol-2-yl]-4-phenyl-5-thiazolyl]acetic acid::2-[2-[3-(furan-2-yl)-5-(4-methoxyphenyl)-3,4-dihydropyrazol-2-yl]-4-phenyl-1,3-thiazol-5-yl]acetic acid::2-[2-[3-(furan-2-yl)-5-(4-methoxyphenyl)-3,4-dihydropyrazol-2-yl]-4-phenyl-1,3-thiazol-5-yl]ethanoic acid::2-[2-[5-(2-furyl)-3-(4-methoxyphenyl)-2-pyrazolin-1-yl]-4-phenyl-thiazol-5-yl]acetic acid::MLS000393143::SMR000247402::cid_4884442
SMILES COc1ccc(cc1)C1=NN(C(C1)c1ccco1)c1nc(c(CC(O)=O)s1)-c1ccccc1
InChI Key InChIKey=CFGHRAUIXLZNBY-UHFFFAOYSA-N
Data  2 IC50
  Tab Delimited (TSV)   2D SDfile   Computed 3D by Vconf -m prep SDfile
Find this compound or compounds like it in BindingDB:
Activity Spreadsheet -- Enzyme Inhibition Constant Data from BindingDB
Found 2 hits for monomerid = 50362
TargetProbable nicotinate-nucleotide adenylyltransferase(Staphylococcus aureus subsp. aureus N315)
Burnham Center For Chemical Genomics
Curated by PubChem BioAssay
LigandPNGBDBM50362(2-[2-[3-(2-furanyl)-5-(4-methoxyphenyl)-3,4-dihydr...)
Affinity DataIC50:  1.85E+4nM
In DepthDetails PCBioAssay
TargetInduced myeloid leukemia cell differentiation protein Mcl-1(Homo sapiens (Human))
Emory University
Curated by PubChem BioAssay
LigandPNGBDBM50362(2-[2-[3-(2-furanyl)-5-(4-methoxyphenyl)-3,4-dihydr...)
Affinity DataIC50:  6.50E+3nM. Assay description: NIH Molecular Libraries Screening Centers Network [MLSCN] Emory Chemical Biology Discovery Center in MLSCN Assay provider: Nikolovska-Coleska, Univer...
In DepthDetails PCBioAssay