BDBM50362544 CHEMBL1941138
SMILES C[C@@H](OP(O)(O)=O)C(O)=O
InChI Key InChIKey=CSZRNWHGZPKNKY-UWTATZPHSA-N
Data  1 KI
PDB links: 6 PDB IDs match this monomer.
  Tab Delimited (TSV)   2D SDfile   Computed 3D by Vconf -m prep SDfile
Find this compound or compounds like it in BindingDB:
Activity Spreadsheet -- Enzyme Inhibition Constant Data from BindingDB
Found 1 hit for monomerid = 50362544
Target2-dehydro-3-deoxyphosphooctonate aldolase(Neisseria meningitidis serogroup B (strain MC58))
University Of Canterbury
Curated by ChEMBL
LigandPNGBDBM50362544(CHEMBL1941138)
Affinity DataKi:  8.70E+5nM. Assay description: Competitive inhibition of Neisseria meningitidis serotype B strain MC58 ATCC BAA355 KDO8P synthase expressed in Escherichia coli BL21 (DE3) cells usi...
In DepthDetails ArticlePubMed