BDBM50364060 CHEMBL1950647
SMILES CCNC(=O)[C@H]1O[C@H]([C@H](O)[C@@H]1O)n1cnc2c(N)nc(NCCc3ccc(CCC(=O)NCCN)cc3)nc12
InChI Key InChIKey=UXUFTKZYJYGMGO-CMCWBKRRSA-N
Data  6 KI
  Tab Delimited (TSV)   2D SDfile   Computed 3D by Vconf -m prep SDfile
Find this compound or compounds like it in BindingDB:
Activity Spreadsheet -- Enzyme Inhibition Constant Data from BindingDB
Found 6 hits for monomerid = 50364060
TargetAdenosine receptor A2a(Rattus norvegicus (rat))
National Institute Of Diabetes
Curated by ChEMBL
LigandPNGBDBM50364060(CHEMBL1950647)
Affinity DataKi:  5.70nM. Assay description: Tested for the binding affinity of A2a receptor by displacing the [3H]-CGS- 21680 in rat striatal membranes
In DepthDetails ArticlePubMed
TargetAdenosine receptor A2a/A2b(Rattus norvegicus)
Niddk
Curated by ChEMBL
LigandPNGBDBM50364060(CHEMBL1950647)
Affinity DataKi:  5.70nM. Assay description: Binding affinity for adenosine A2 receptor using [3H]- NECA
In DepthDetails ArticlePubMed
TargetAdenosine receptor A2a(Rattus norvegicus (rat))
National Institute Of Diabetes
Curated by ChEMBL
LigandPNGBDBM50364060(CHEMBL1950647)
Affinity DataKi:  5.73nM. Assay description: Displacement of [3H]NECA from A2A adenosine receptor expressed in rat striatal membranes after 30 mins by liquid scintillation counting
In DepthDetails ArticlePubMed
TargetAdenosine receptor A3(Rattus norvegicus)
National Institute Of Diabetes
Curated by ChEMBL
LigandPNGBDBM50364060(CHEMBL1950647)
Affinity DataKi:  50nM. Assay description: Tested for the binding affinity of A3 receptor by displacing N6-[[125I]-4-amino-3-iodobenzyl]-adenosine-5''-N-methyluronamide from membranes of CHO ...
In DepthDetails ArticlePubMed
TargetAdenosine receptor A1(Rattus norvegicus (rat))
Niddk
Curated by ChEMBL
LigandPNGBDBM50364060(CHEMBL1950647)
Affinity DataKi:  240nM. Assay description: Binding affinity against adenosine A1 receptor using [3H]-CHA or [3H]PIA as radioligand
In DepthDetails ArticlePubMed
TargetAdenosine receptor A1(Rattus norvegicus (rat))
Niddk
Curated by ChEMBL
LigandPNGBDBM50364060(CHEMBL1950647)
Affinity DataKi:  400nM. Assay description: Tested for the binding affinity of A1 receptor by displacing the [3H]-PIA in rat brain membranes
In DepthDetails ArticlePubMed