BDBM50366282 CHEMBL4172762
SMILES CC(C)NC(=O)Cn1cc(CN2CCN(C)CC2)c2ccc(NC(=S)NCCc3c[nH]c4ccccc34)cc12
InChI Key InChIKey=DCSGGGDRUYCRAM-UHFFFAOYSA-N
Data  1 IC50  1 Kd
PDB links: 1 PDB ID matches this monomer.
  Tab Delimited (TSV)   2D SDfile   Computed 3D by Vconf -m prep SDfile
Find this compound or compounds like it in BindingDB:
Activity Spreadsheet -- Enzyme Inhibition Constant Data from BindingDB
Found 2 hits for monomerid = 50366282
TargetB-cell lymphoma 6 protein(Homo sapiens)
University Of Maryland
Curated by ChEMBL
LigandPNGBDBM50366282(CHEMBL4172762)
Affinity DataIC50:  1.42E+5nM. Assay description: Binding affinity to N-terminal thioredoxin-His6 tag with N-terminal thrombin-cleavage site containing recombinant BCL6 BTB domain C8Q/C67R/C84N/E99V ...
TargetB-cell lymphoma 6 protein(Homo sapiens)
University Of Maryland
Curated by ChEMBL
LigandPNGBDBM50366282(CHEMBL4172762)
Affinity DataKd:  2.19E+5nM. Assay description: Binding affinity to isotopically labeled and N-terminal thioredoxin-His6 tag with N-terminal thrombin-cleavage site containing recombinant BCL6 BTB d...