BDBM50366287 CHEMBL4175189
SMILES S=C(NCCc1ccccc1)Nc1cccnc1
InChI Key InChIKey=VMCPIEORRRSZLR-UHFFFAOYSA-N
Data  2 Kd
PDB links: 1 PDB ID matches this monomer.
  Tab Delimited (TSV)   2D SDfile   Computed 3D by Vconf -m prep SDfile
Find this compound or compounds like it in BindingDB:
Activity Spreadsheet -- Enzyme Inhibition Constant Data from BindingDB
Found 2 hits for monomerid = 50366287
TargetB-cell lymphoma 6 protein(Homo sapiens)
East China Normal University
Curated by ChEMBL
LigandPNGBDBM50366287(CHEMBL4175189)
Affinity DataKd:  3.20E+6nM. Assay description: Binding affinity to BCL6 BTB domain (unknown origin) by NMR analysis
TargetB-cell lymphoma 6 protein(Homo sapiens)
East China Normal University
Curated by ChEMBL
LigandPNGBDBM50366287(CHEMBL4175189)
Affinity DataKd:  3.20E+6nM. Assay description: Binding affinity to isotopically labeled and N-terminal thioredoxin-His6 tag with N-terminal thrombin-cleavage site containing recombinant BCL6 BTB d...