BDBM50366436 CHEMBL605454
SMILES Nc1ncnc2n(cnc12)C1O[C@H](COP(O)(=O)O[C@@H]2[C@@H](COP(O)(=O)O[C@@H]3[C@@H](OP(O)(O)=O)O[C@@H]([C@@H]3O)n3cnc4c(N)ncnc34)O[C@@H]([C@@H]2O)n2cnc3c(N)ncnc23)[C@@H](O)[C@H]1O
InChI Key InChIKey=QIMYZCOBXCITIG-IDGPKWJESA-N
Data  2 IC50
  Tab Delimited (TSV)   2D SDfile   Computed 3D by Vconf -m prep SDfile
Find this compound or compounds like it in BindingDB:
Activity Spreadsheet -- Enzyme Inhibition Constant Data from BindingDB
Found 2 hits for monomerid = 50366436
Target2-5A-dependent ribonuclease(Mus musculus)
TBA
Curated by ChEMBL
LigandPNGBDBM50366436(CHEMBL605454)
Affinity DataIC50: >5.00E+4nM. Assay description: Compound concentration which displaces 50% of [125I]-labeled 2-5A probe bound to RNase L from mouse L cell extractChecked by Author
In DepthDetails Article
Target2-5A-dependent ribonuclease(Homo sapiens (Human))
TBA
Curated by ChEMBL
LigandPNGBDBM50366436(CHEMBL605454)
Affinity DataIC50: >5.00E+4nM. Assay description: Compound concentration which displaces 50% of [125I]-labeled 2-5A probe bound to RNase L from rabbit reticulocyte lysateChecked by Author
In DepthDetails Article