BDBM50366859 CHEMBL605389
SMILES CC[C@H](C)[C@H](N)C(=O)NS(=O)(=O)OC[C@H]1OC([C@H](O)[C@@H]1O)n1cnc2c(NC)nc(I)nc12
InChI Key InChIKey=BCVBJXQWJBXGPQ-LOVLJXCNSA-N
Data  1 IC50
  Tab Delimited (TSV)   2D SDfile   Computed 3D by Vconf -m prep SDfile
Find this compound or compounds like it in BindingDB:
Activity Spreadsheet -- Enzyme Inhibition Constant Data from BindingDB
Found 1 hit for monomerid = 50366859
TargetIsoleucine--tRNA ligase, cytoplasmic(Homo sapiens (Human))
Seoul National University
Curated by ChEMBL
LigandPNGBDBM50366859(CHEMBL605389)
Affinity DataIC50:  2.22E+4nM. Assay description: Inhibitory activity against Escherichia coli Isoleucyl-tRNA synthetase was determined
In DepthDetails ArticlePubMed