BDBM50366863 CHEMBL605806
SMILES CCCCC#Cc1nc(N)c2ncn(C3O[C@H](COS(=O)(=O)NC(=O)[C@@H](N)CCSC)[C@@H](O)[C@H]3O)c2n1
InChI Key InChIKey=NHAUWNFNNPFQTH-YKJSEVMDSA-N
Data  1 IC50
  Tab Delimited (TSV)   2D SDfile   Computed 3D by Vconf -m prep SDfile
Find this compound or compounds like it in BindingDB:
Activity Spreadsheet -- Enzyme Inhibition Constant Data from BindingDB
Found 1 hit for monomerid = 50366863
TargetMethionine--tRNA ligase, cytoplasmic(Homo sapiens (Human))
Seoul National University
Curated by ChEMBL
LigandPNGBDBM50366863(CHEMBL605806)
Affinity DataIC50:  1.90E+3nM. Assay description: Inhibitory activity against Escherichia coli Methionyl-tRNA synthetase was determined
In DepthDetails ArticlePubMed