BDBM50369095 CHEMBL605057
SMILES CCNC(=O)[C@H]1OC([C@H](O)[C@@H]1O)n1cnc2c(N)nc(nc12)C#Cc1cccc2ccccc12
InChI Key InChIKey=LSPIHDRNXJOIAM-PHTWQSKTSA-N
Data  4 KI  2 EC50
  Tab Delimited (TSV)   2D SDfile   Computed 3D by Vconf -m prep SDfile
Find this compound or compounds like it in BindingDB:
Activity Spreadsheet -- Enzyme Inhibition Constant Data from BindingDB
Found 6 hits for monomerid = 50369095
TargetAdenosine receptor A2a(Rattus norvegicus (rat))
Universit£
Curated by ChEMBL
LigandPNGBDBM50369095(CHEMBL605057)
Affinity DataKi:  488nM. Assay description: Binding affinity against adenosine A2a receptor from rat striatum using [3H]-CGS- 21680 as a radioligand.
In DepthDetails ArticlePubMed
TargetAdenosine receptor A2a(Rattus norvegicus (rat))
Universit£
Curated by ChEMBL
LigandPNGBDBM50369095(CHEMBL605057)
Affinity DataKi:  488nM. Assay description: Binding affinity towards adenosine A2A receptor in rat brain striatum
In DepthDetails ArticlePubMed
TargetAdenosine receptor A1(Rattus norvegicus (rat))
Universit£
Curated by ChEMBL
LigandPNGBDBM50369095(CHEMBL605057)
Affinity DataKi:  4.46E+3nM. Assay description: Binding affinity against adenosine A1 receptor from rat brain using [3H]CHA as a radioligand.
In DepthDetails ArticlePubMed
TargetAdenosine receptor A1(Rattus norvegicus (rat))
Universit£
Curated by ChEMBL
LigandPNGBDBM50369095(CHEMBL605057)
Affinity DataKi:  4.46E+3nM. Assay description: Binding affinity towards adenosine A1 receptor in rat brain cortex
In DepthDetails ArticlePubMed
TargetAdenosine receptor A1(Rattus norvegicus (rat))
Universit£
Curated by ChEMBL
LigandPNGBDBM50369095(CHEMBL605057)
Affinity DataEC50: >1.00E+4nM. Assay description: Functional activity against adenosine A1 receptor from rat atria.
In DepthDetails ArticlePubMed
TargetAdenosine receptor A2a(Rattus norvegicus (rat))
Universit£
Curated by ChEMBL
LigandPNGBDBM50369095(CHEMBL605057)
Affinity DataEC50:  468nM. Assay description: Functional activity against adenosine A2a receptor from rat aorta.
In DepthDetails ArticlePubMed