BDBM50369158 CHEMBL612224
SMILES Nc1ncnc2n(cnc12)C1O[C@@H]([C@@H](O)[C@H]1O)C(=O)OCc1ccccc1
InChI Key InChIKey=MWRLOONYLXZSAW-IVMGVGPUSA-N
Data  1 KI
  Tab Delimited (TSV)   2D SDfile   Computed 3D by Vconf -m prep SDfile
Find this compound or compounds like it in BindingDB:
Activity Spreadsheet -- Enzyme Inhibition Constant Data from BindingDB
Found 1 hit for monomerid = 50369158
TargetAdenosylhomocysteinase(Homo sapiens (Human))
Brigham Young University
Curated by ChEMBL
LigandPNGBDBM50369158(CHEMBL612224)
Affinity DataKi:  360nM. Assay description: Inhibition of S-adenosyl-L-homocysteine hydrolase, inactivation rate constant.
In DepthDetails ArticlePubMed