BDBM50370327 CHEMBL1202901
SMILES CCC(CC)N1CCN(CC1)C(=O)Cc1ccc(cc1)C(F)(F)F
InChI Key InChIKey=XWHSFKWQSMVQHW-UHFFFAOYSA-N
Data  1 KI
  Tab Delimited (TSV)   2D SDfile   Computed 3D by Vconf -m prep SDfile
Find this compound or compounds like it in BindingDB:
Activity Spreadsheet -- Enzyme Inhibition Constant Data from BindingDB
Found 1 hit for monomerid = 50370327
TargetHistamine H3 receptor(Homo sapiens (Human))
Novo Nordisk
Curated by ChEMBL
LigandPNGBDBM50370327(CHEMBL1202901)
Affinity DataKi:  2.30nM. Assay description: Antagonist potency against human histamine H3 receptor expressed in CHO cells was determined by GTPgamma-S-assay
In DepthDetails ArticlePubMed