BDBM50370449 CHEMBL609340
SMILES CCNC(=O)[C@@H]1OC([C@@H](O)[C@H]1O)n1cnc2c(NC(=O)Nc3ccc(cc3)S(=O)(=O)Nc3ncccn3)ncnc12
InChI Key InChIKey=QRRCPELOVIBHAK-IJIRQLBGSA-N
Data  2 KI
  Tab Delimited (TSV)   2D SDfile   Computed 3D by Vconf -m prep SDfile
Find this compound or compounds like it in BindingDB:
Activity Spreadsheet -- Enzyme Inhibition Constant Data from BindingDB
Found 2 hits for monomerid = 50370449
TargetAdenosine receptor A3(Rattus norvegicus)
Experimental Sugar Cane Station&Quot;Villa Clara-Cienfuegos&Quot
Curated by ChEMBL
LigandPNGBDBM50370449(CHEMBL609340)
Affinity DataKi:  405nM. Assay description: Displacement of radioligand [125I]AB-MECA binding at rat A3 receptor expressed in CHO cells
In DepthDetails ArticlePubMed
TargetAdenosine receptor A1(Rattus norvegicus (rat))
Experimental Sugar Cane Station
Curated by ChEMBL
LigandPNGBDBM50370449(CHEMBL609340)
Affinity DataKi:  725nM. Assay description: Inhibition of [3H]R-PIA binding to Adenosine A1 receptor from rat brain membrane
In DepthDetails ArticlePubMed