BDBM50370627 CHEMBL4169689::US10954217, Example 00243
SMILES CCOC(=O)CCN1CCN(CC1)c1ccc2CCN(Cc2c1)C(=O)OCc1ccccc1
InChI Key InChIKey=HLXXHUQBOMNXCU-UHFFFAOYSA-N
Data  17 KI
  Tab Delimited (TSV)   2D SDfile   Computed 3D by Vconf -m prep SDfile
Find this compound or compounds like it in BindingDB:
Activity Spreadsheet -- Enzyme Inhibition Constant Data from BindingDB
Found 17 hits for monomerid = 50370627
TargetHistamine H1 receptor(Homo sapiens (Human))
University Of Texas At Austin
Curated by ChEMBL
LigandPNGBDBM50370627(CHEMBL4169689 | US10954217, Example 00243)
Affinity DataKi:  62nM. Assay description: Displacement of [3H]-Pyrilamine from human histamine H1 receptor expressed in stable HEK cells after 90 mins by microbeta scintillation counting meth...
In DepthDetails ArticlePubMed
TargetSigma intracellular receptor 2(Rattus norvegicus (Rat))
University Of Texas At Austin
Curated by ChEMBL
LigandPNGBDBM50370627(CHEMBL4169689 | US10954217, Example 00243)
Affinity DataKi:  198nM. Assay description: Displacement of [3H]-ditolylguanidine from sigma2 receptor in rat PC12 cells by microbeta scintillation counting method
In DepthDetails ArticlePubMed
TargetSigma intracellular receptor 2(Homo sapiens (Human))
Board Of Regents, The University Of Texas System
US Patent
LigandPNGBDBM50370627(CHEMBL4169689 | US10954217, Example 00243)
Affinity DataKi:  198nM. Assay description: TBD
In DepthDetails US Patent
Target5-hydroxytryptamine receptor 1A(Homo sapiens (Human))
University Of Texas At Austin
Curated by ChEMBL
LigandPNGBDBM50370627(CHEMBL4169689 | US10954217, Example 00243)
Affinity DataKi:  335nM. Assay description: Displacement of [3H]-WAY100635 from human 5-HT1A receptor expressed in stable CHO cells after 90 mins by microbeta scintillation counting method
In DepthDetails ArticlePubMed
TargetSigma non-opioid intracellular receptor 1(Cavia porcellus (Guinea pig))
University Of Texas At Austin
Curated by ChEMBL
LigandPNGBDBM50370627(CHEMBL4169689 | US10954217, Example 00243)
Affinity DataKi:  407nM. Assay description: Displacement of [3H]-Pentazocine from sigma1 receptor in guinea pig brain membrane by microbeta scintillation counting method
In DepthDetails ArticlePubMed
TargetSigma non-opioid intracellular receptor 1(Homo sapiens (Human))
Board Of Regents, The University Of Texas System
US Patent
LigandPNGBDBM50370627(CHEMBL4169689 | US10954217, Example 00243)
Affinity DataKi:  407nM. Assay description: TBD
In DepthDetails US Patent
Target5-hydroxytryptamine receptor 2A(Homo sapiens (Human))
University Of Texas At Austin
Curated by ChEMBL
LigandPNGBDBM50370627(CHEMBL4169689 | US10954217, Example 00243)
Affinity DataKi:  475nM. Assay description: Displacement of [3H]-Ketanserin from human 5-HT2A receptor expressed in HEKT cells after 90 mins by microbeta scintillation counting method
In DepthDetails ArticlePubMed
Target5-hydroxytryptamine receptor 2B(Homo sapiens (Human))
University Of Texas At Austin
Curated by ChEMBL
LigandPNGBDBM50370627(CHEMBL4169689 | US10954217, Example 00243)
Affinity DataKi:  505nM. Assay description: Displacement of [3H]-LSD from human 5-HT2B receptor expressed in stable HEK cells after 90 mins by microbeta scintillation counting method
In DepthDetails ArticlePubMed
TargetHistamine H2 receptor(Homo sapiens (Human))
University Of Texas At Austin
Curated by ChEMBL
LigandPNGBDBM50370627(CHEMBL4169689 | US10954217, Example 00243)
Affinity DataKi:  507nM. Assay description: Displacement of [125I]-iodoaminopotentidine from human histamine H2 receptor expressed in stable HEK cells after 90 mins by microbeta scintillation c...
In DepthDetails ArticlePubMed
Target5-hydroxytryptamine receptor 2C(Homo sapiens (Human))
University Of Texas At Austin
Curated by ChEMBL
LigandPNGBDBM50370627(CHEMBL4169689 | US10954217, Example 00243)
Affinity DataKi:  908nM. Assay description: Displacement of [3H]-Mesulergine from human 5-HT2C receptor expressed in HEKT cells after 90 mins by microbeta scintillation counting method
In DepthDetails ArticlePubMed
TargetSodium-dependent noradrenaline transporter(Homo sapiens (Human))
University Of Texas At Austin
Curated by ChEMBL
LigandPNGBDBM50370627(CHEMBL4169689 | US10954217, Example 00243)
Affinity DataKi:  1.06E+3nM. Assay description: Displacement of [3H]-Nisoxetine from human NET receptor expressed in stable HEK cells after 90 mins by microbeta scintillation counting method
In DepthDetails ArticlePubMed
Target5-hydroxytryptamine receptor 1E(Homo sapiens (Human))
University Of Texas At Austin
Curated by ChEMBL
LigandPNGBDBM50370627(CHEMBL4169689 | US10954217, Example 00243)
Affinity DataKi:  1.67E+3nM. Assay description: Displacement of [3H]-5-HT from human 5-HT1E receptor expressed in stable HEK cells after 90 mins by microbeta scintillation counting method
In DepthDetails ArticlePubMed
Target5-hydroxytryptamine receptor 1B(Homo sapiens (Human))
University Of Texas At Austin
Curated by ChEMBL
LigandPNGBDBM50370627(CHEMBL4169689 | US10954217, Example 00243)
Affinity DataKi:  2.44E+3nM. Assay description: Displacement of [3H]-5-CT from human 5-HT1B receptor expressed in stable HEK cells after 90 mins by microbeta scintillation counting method
In DepthDetails ArticlePubMed
TargetMuscarinic acetylcholine receptor M5(Homo sapiens (Human))
University Of Texas At Austin
Curated by ChEMBL
LigandPNGBDBM50370627(CHEMBL4169689 | US10954217, Example 00243)
Affinity DataKi:  2.59E+3nM. Assay description: Displacement of [3H]-QNB/[3H]-NMS from human muscarinic M5 receptor expressed in stable CHO cells after 90 mins by microbeta scintillation counting m...
In DepthDetails ArticlePubMed
TargetSodium-dependent dopamine transporter(Homo sapiens (Human))
University Of Texas At Austin
Curated by ChEMBL
LigandPNGBDBM50370627(CHEMBL4169689 | US10954217, Example 00243)
Affinity DataKi:  2.96E+3nM. Assay description: Displacement of [3H]-Win35428 from human DAT expressed in stable HEK cells after 90 mins by microbeta scintillation counting method
In DepthDetails ArticlePubMed
TargetAlpha-1D adrenergic receptor(Homo sapiens (Human))
University Of Texas At Austin
Curated by ChEMBL
LigandPNGBDBM50370627(CHEMBL4169689 | US10954217, Example 00243)
Affinity DataKi:  3.52E+3nM. Assay description: Displacement of [3H]-Prazosin from human adrenergic alpha1D receptor after 90 mins by microbeta scintillation counting method
In DepthDetails ArticlePubMed
Target5-hydroxytryptamine receptor 5A(Homo sapiens (Human))
University Of Texas At Austin
Curated by ChEMBL
LigandPNGBDBM50370627(CHEMBL4169689 | US10954217, Example 00243)
Affinity DataKi: >1.00E+4nM. Assay description: Displacement of [3H]-LSD from human 5-HT5A receptor expressed in Flp-In CHO cells after 90 mins by microbeta scintillation counting method
In DepthDetails ArticlePubMed