BDBM50370989 CHEMBL226398
SMILES Fc1ccc2C(=O)OCc2c1
InChI Key InChIKey=KKDJJBAMSYLYQS-UHFFFAOYSA-N
Data  1 IC50
  Tab Delimited (TSV)   2D SDfile   Computed 3D by Vconf -m prep SDfile
Find this compound or compounds like it in BindingDB:
Activity Spreadsheet -- Enzyme Inhibition Constant Data from BindingDB
Found 1 hit for monomerid = 50370989
TargetLeucine--tRNA ligase, cytoplasmic(Saccharomyces cerevisiae S288c)
Anacor Pharmaceuticals
Curated by ChEMBL
LigandPNGBDBM50370989(CHEMBL226398)
Affinity DataIC50: >1.00E+5nM. Assay description: Inhibition of Saccharomyces cerevisiae cytoplasmic leucyl-tRNA synthetase assessed as tRNA amino-acylation
In DepthDetails ArticlePubMed