BDBM50375436 CHEMBL260869
SMILES COc1ccc(cn1)-c1ccc(cc1)[C@H]1C[C@@]2(C)[C@@H](C[C@@H](C)[C@@H]2C(=O)C2CC2)[C@@H]2CCC3=CC(=O)CCC3=C12
InChI Key InChIKey=RAYOYPZHJJVWFU-VYRBCWFISA-N
Data  1 IC50  1 EC50
  Tab Delimited (TSV)   2D SDfile   Computed 3D by Vconf -m prep SDfile
Find this compound or compounds like it in BindingDB:
Activity Spreadsheet -- Enzyme Inhibition Constant Data from BindingDB
Found 2 hits for monomerid = 50375436
TargetProgesterone receptor(Homo sapiens (Human))
Nv Organon
Curated by ChEMBL
LigandPNGBDBM50375436(CHEMBL260869)
Affinity DataIC50:  0.630nM. Assay description: Antagonist activity at human PRB expressed in CHO cells assessed as inhibition of Org 2058 induced-transactivation
In DepthDetails ArticlePubMed
TargetProgesterone receptor(Homo sapiens (Human))
Nv Organon
Curated by ChEMBL
LigandPNGBDBM50375436(CHEMBL260869)
Affinity DataEC50:  0.120nM. Assay description: Agonist activity at human PRB expressed in CHO cells
In DepthDetails ArticlePubMed