BDBM50375970 CHEMBL428781
SMILES COc1ccccc1N1CCN(CCCC(=O)NCc2nc3ccccc3c(=O)n2-c2ccccc2)CC1
InChI Key InChIKey=GRNKXTVUQCOUIS-UHFFFAOYSA-N
Data  2 IC50
  Tab Delimited (TSV)   2D SDfile   Computed 3D by Vconf -m prep SDfile
Find this compound or compounds like it in BindingDB:
Activity Spreadsheet -- Enzyme Inhibition Constant Data from BindingDB
Found 2 hits for monomerid = 50375970
Target5-hydroxytryptamine receptor 7(Homo sapiens (Human))
Sharif University Of Technology
Curated by ChEMBL
LigandPNGBDBM50375970(CHEMBL428781)
Affinity DataIC50:  21.0nM. Assay description: Inhibition of 5HT7 receptor by radioligand binding assay
In DepthDetails ArticlePubMed
Target5-hydroxytryptamine receptor 7(Homo sapiens (Human))
Sharif University Of Technology
Curated by ChEMBL
LigandPNGBDBM50375970(CHEMBL428781)
Affinity DataIC50:  21nM. Assay description: Displacement of [3H]LSD from human recombinant 5HT7 receptor
In DepthDetails ArticlePubMed