BDBM50376037 CHEMBL410841
SMILES COc1cc2nccc(Oc3ccc4c(cccc4c3)C(=O)Nc3ccc(F)cc3)c2cc1OC
InChI Key InChIKey=ZNCWTNYRBDMTLK-UHFFFAOYSA-N
Data  2 IC50
  Tab Delimited (TSV)   2D SDfile   Computed 3D by Vconf -m prep SDfile
Find this compound or compounds like it in BindingDB:
Activity Spreadsheet -- Enzyme Inhibition Constant Data from BindingDB
Found 2 hits for monomerid = 50376037
TargetVascular endothelial growth factor receptor 2(Homo sapiens (Human))
Lanzhou University
Curated by ChEMBL
LigandPNGBDBM50376037(CHEMBL410841)
Affinity DataIC50:  1nM. Assay description: Inhibition of human VEGFR2 after 60 mins
In DepthDetails ArticlePubMed
TargetVascular endothelial growth factor receptor 2(Homo sapiens (Human))
Lanzhou University
Curated by ChEMBL
LigandPNGBDBM50376037(CHEMBL410841)
Affinity DataIC50:  1nM. Assay description: Inhibition of KDR by HTRF assay
In DepthDetails ArticlePubMed