BDBM50376167 CHEMBL259457
SMILES CN1C\C(=C/c2cc(Br)c(O)c(Br)c2)C(=O)\C(C1)=C\c1cc(Br)c(O)c(Br)c1
InChI Key InChIKey=SBZKOOAOHRJMSI-TUOIWHRTSA-N
Data  1 IC50
  Tab Delimited (TSV)   2D SDfile   Computed 3D by Vconf -m prep SDfile
Find this compound or compounds like it in BindingDB:
Activity Spreadsheet -- Enzyme Inhibition Constant Data from BindingDB
Found 1 hit for monomerid = 50376167
TargetRmtA(Emericella nidulans)
Sapienza University Of Rome
Curated by ChEMBL
LigandPNGBDBM50376167(CHEMBL259457)
Affinity DataIC50:  3.90E+4nM. Assay description: Inhibition of Aspergillus nidulans RmtA
In DepthDetails ArticlePubMed