BDBM50378558 CHEMBL578135
SMILES CN1CC(CC(C)(C)O)=Nc2c1nc(N)[nH]c2=O
InChI Key InChIKey=WRSJTVSFGTWZBM-UHFFFAOYSA-N
Data  1 IC50
PDB links: 1 PDB ID matches this monomer.
  Tab Delimited (TSV)   2D SDfile   Computed 3D by Vconf -m prep SDfile
Find this compound or compounds like it in BindingDB:
Activity Spreadsheet -- Enzyme Inhibition Constant Data from BindingDB
Found 1 hit for monomerid = 50378558
TargetDihydropteroate synthase(Bacillus anthracis)
University Of Tennessee Health Science Center
Curated by ChEMBL
LigandPNGBDBM50378558(CHEMBL578135)
Affinity DataIC50:  2.15E+5nM. Assay description: Inhibition of Bacillus anthracis DHPS expressed in Escherichia coli BL21 (DE3) after 30 mins