BDBM50378930 CHEMBL2011230
SMILES O[C@@H](CNCCNC(=O)Nc1nnn(CCF)n1)COc1ccccc1C#N
InChI Key InChIKey=LXFYBZNDZHSJIX-ZDUSSCGKSA-N
Data  1 IC50
  Tab Delimited (TSV)   2D SDfile   Computed 3D by Vconf -m prep SDfile
Find this compound or compounds like it in BindingDB:
Activity Spreadsheet -- Enzyme Inhibition Constant Data from BindingDB
Found 1 hit for monomerid = 50378930
TargetBeta-1 adrenergic receptor(Homo sapiens (Human))
TBA
Curated by ChEMBL
LigandPNGBDBM50378930(CHEMBL2011230)
Affinity DataIC50:  10nM. Assay description: Displacement of [3H](-)-CGP-12177 from adrenergic beta1 receptor by cell based assay
In DepthDetails ArticlePubMed