BDBM50379547 CHEMBL2012859
SMILES CN1CCN(Cc2cc(cs2)-c2ccc3c(N)cc4n[nH]c(=O)n4c3c2)CC1
InChI Key InChIKey=UXQPQUCKOGICTL-UHFFFAOYSA-N
Data  1 IC50
  Tab Delimited (TSV)   2D SDfile   Computed 3D by Vconf -m prep SDfile
Find this compound or compounds like it in BindingDB:
Activity Spreadsheet -- Enzyme Inhibition Constant Data from BindingDB
Found 1 hit for monomerid = 50379547
TargetSerine/threonine-protein kinase Chk1(Homo sapiens (Human))
Astrazeneca R&D Boston
Curated by ChEMBL
LigandPNGBDBM50379547(CHEMBL2012859)
Affinity DataIC50:  4nM. Assay description: Inhibition of Chk1
In DepthDetails ArticlePubMed