BDBM50380337 CHEMBL2017798
SMILES Oc1ccc(O)c(c1)C1NC(=O)C(C#N)=C(SCc2ccccc2)S1
InChI Key InChIKey=JBQLPIQAJGPJAG-UHFFFAOYSA-N
Data  1 IC50
  Tab Delimited (TSV)   2D SDfile   Computed 3D by Vconf -m prep SDfile
Find this compound or compounds like it in BindingDB:
Activity Spreadsheet -- Enzyme Inhibition Constant Data from BindingDB
Found 1 hit for monomerid = 50380337
TargetGalactokinase(Homo sapiens (Human))
TBA
Curated by ChEMBL
LigandPNGBDBM50380337(CHEMBL2017798)
Affinity DataIC50:  700nM. Assay description: Inhibition of human galactokinase after 30 mins by Kinase-GloTM assay
In DepthDetails ArticlePubMed