BDBM50382349 CHEMBL2024341
SMILES CC(C)(COP(O)(=O)OP(O)(=O)OC[C@H]1O[C@H]([C@H](O)[C@@H]1OP(O)(O)=O)n1cnc2c(N)ncnc12)[C@@H](O)C(=O)NCCC(=O)NCCSC(CC(=O)c1ccccc1[N+]([O-])=O)C(O)=O
InChI Key InChIKey=AKNMIGDAWDDWDJ-DVXAHSAASA-N
Data  1 IC50
  Tab Delimited (TSV)   2D SDfile   Computed 3D by Vconf -m prep SDfile
Find this compound or compounds like it in BindingDB:
Activity Spreadsheet -- Enzyme Inhibition Constant Data from BindingDB
Found 1 hit for monomerid = 50382349
Target1,4-dihydroxy-2-naphthoyl-CoA synthase(Mycobacterium tuberculosis)
TBA
Curated by ChEMBL
LigandPNGBDBM50382349(CHEMBL2024341)
Affinity DataIC50:  154nM. Assay description: Inhibition of Mycobacterium tuberculosis MenB expressed in Escherichia coli BL21 (DE3) assessed as formation of DHNA-CoA from OSB-CoA by enzyme coupl...
In DepthDetails ArticlePubMed