BDBM50383733 CHEMBL2030396
SMILES Brc1ccc2oc3c(nc([nH]c3=O)C3CCNCC3)c2c1
InChI Key InChIKey=GVUXAQWOKREQBF-UHFFFAOYSA-N
Data  3 IC50
  Tab Delimited (TSV)   2D SDfile   Computed 3D by Vconf -m prep SDfile
Find this compound or compounds like it in BindingDB:
Activity Spreadsheet -- Enzyme Inhibition Constant Data from BindingDB
Found 3 hits for monomerid = 50383733
TargetCell division cycle 7-related protein kinase(Homo sapiens (Human))
Exelixis
Curated by ChEMBL
LigandPNGBDBM50383733(CHEMBL2030396)
Affinity DataIC50:  6.20nM. Assay description: Inhibition of N-terminus Myc-tagged human CDC7 expressed in Escherichia coli by chemiluminescence assay in presence of ATP
In DepthDetails ArticlePubMed
TargetCell division cycle 7-related protein kinase(Homo sapiens (Human))
Exelixis
Curated by ChEMBL
LigandPNGBDBM50383733(CHEMBL2030396)
Affinity DataIC50:  1.43E+3nM. Assay description: Inhibition of CDC7 in human MDA-MB-231T cells assessed as inhibition of MCM2 phosphorylation at Ser53 after 4 hrs
In DepthDetails ArticlePubMed
TargetSerine/threonine-protein kinase pim-1(Homo sapiens (Human))
Exelixis
Curated by ChEMBL
LigandPNGBDBM50383733(CHEMBL2030396)
Affinity DataIC50:  22nM. Assay description: Inhibition of N-terminus His-tagged human PIM1 expressed in Escherichia coli using AKRRRLSA as substrate after 1 to 2 hrs by chemiluminescence assay
In DepthDetails ArticlePubMed