BDBM50385772 CHEMBL2040851
SMILES COc1ccc(C(O)=O)c(Nc2ccc(cc2)C(O)=O)c1
InChI Key InChIKey=UPWJTFVOIHZZKC-UHFFFAOYSA-N
Data  2 IC50
  Tab Delimited (TSV)   2D SDfile   Computed 3D by Vconf -m prep SDfile
Find this compound or compounds like it in BindingDB:
Activity Spreadsheet -- Enzyme Inhibition Constant Data from BindingDB
Found 2 hits for monomerid = 50385772
TargetAldo-keto reductase family 1 member C3(Homo sapiens (Human))
University Of Pennsylvania
Curated by ChEMBL
LigandPNGBDBM50385772(CHEMBL2040851)
Affinity DataIC50:  690nM. Assay description: Inhibition of recombinant AKR1C3 assessed as NADP+ dependent oxidation of S-tetralol by fluorescence assay
In DepthDetails ArticlePubMed
TargetAldo-keto reductase family 1 member C2(Homo sapiens (Human))
University Of Pennsylvania
Curated by ChEMBL
LigandPNGBDBM50385772(CHEMBL2040851)
Affinity DataIC50:  980nM. Assay description: Inhibition of recombinant AKR1C2 assessed as NADP+ dependent oxidation of S-tetralol by fluorescence assay
In DepthDetails ArticlePubMed