BDBM50386378 CHEMBL2048415
SMILES CCOc1ccc(Cc2nc3cc(ccc3n2CCN(CC)CC)N=C(C)N)cc1
InChI Key InChIKey=XRFPDRVMYWWIDB-UHFFFAOYSA-N
Data  1 KI  2 IC50  1 EC50
  Tab Delimited (TSV)   2D SDfile   Computed 3D by Vconf -m prep SDfile
Find this compound or compounds like it in BindingDB:
Activity Spreadsheet -- Enzyme Inhibition Constant Data from BindingDB
Found 4 hits for monomerid = 50386378
TargetMu-type opioid receptor(Homo sapiens (Human))
TBA
Curated by ChEMBL
LigandPNGBDBM50386378(CHEMBL2048415)
Affinity DataKi:  48nM. Assay description: Displacement of [3H]DAMGO from human mu opioid receptor expressed in HEK-293 cells by scintillation counting
In DepthDetails ArticlePubMed
TargetNitric oxide synthase, brain(Homo sapiens (Human))
TBA
Curated by ChEMBL
LigandPNGBDBM50386378(CHEMBL2048415)
Affinity DataIC50: >1.00E+5nM. Assay description: Inhibition of human recombinant nNOS assessed as conversion of [3H]L-arginine to [3H]L-citrulline preincubated for 15 mins measured after 45 mins by ...
In DepthDetails ArticlePubMed
TargetNitric oxide synthase, endothelial(Homo sapiens (Human))
TBA
Curated by ChEMBL
LigandPNGBDBM50386378(CHEMBL2048415)
Affinity DataIC50: >1.00E+5nM. Assay description: Inhibition of human recombinant eNOS assessed as conversion of [3H]L-arginine to [3H]L-citrulline preincubated for 15 mins measured after 45 mins by ...
In DepthDetails ArticlePubMed
TargetMu-type opioid receptor(Homo sapiens (Human))
TBA
Curated by ChEMBL
LigandPNGBDBM50386378(CHEMBL2048415)
Affinity DataEC50:  940nM. Assay description: Agonist activity at human mu opioid receptor expressed in CHO cells assessed as inhibition of forskolin-induced cAMP accumulation after 1 hr by HTRF ...
In DepthDetails ArticlePubMed