BDBM50387276 CHEMBL2048561
SMILES COCCCOc1ccccc1N1CCN(CC(N)C(O)CC(C(C)C)C(=O)NCC(C)(C)C(N)=O)CC1=O
InChI Key InChIKey=FOAHAYKWNMPVJI-UHFFFAOYSA-N
Data  2 IC50
PDB links: 1 PDB ID matches this monomer.
  Tab Delimited (TSV)   2D SDfile   Computed 3D by Vconf -m prep SDfile
Find this compound or compounds like it in BindingDB:
Activity Spreadsheet -- Enzyme Inhibition Constant Data from BindingDB
Found 2 hits for monomerid = 50387276
TargetRenin(Macaca fascicularis)
Daiichi Sankyo
Curated by ChEMBL
LigandPNGBDBM50387276(CHEMBL2048561)
Affinity DataIC50:  2.80E+3nM. Assay description: Inhibition of renin in cynomolgus monkey plasma
TargetRenin(Homo sapiens (Human))
Daiichi Sankyo
Curated by ChEMBL
LigandPNGBDBM50387276(CHEMBL2048561)
Affinity DataIC50:  130nM. Assay description: Inhibition of human purified renin