BDBM50387724 CHEMBL2058876
SMILES NC(=N)SCc1ccccc1C(=O)c1ccc(Cl)cc1CSC(N)=N
InChI Key InChIKey=MJOORKVVDZCKMJ-UHFFFAOYSA-N
Data  1 IC50
  Tab Delimited (TSV)   2D SDfile   Computed 3D by Vconf -m prep SDfile
Find this compound or compounds like it in BindingDB:
Activity Spreadsheet -- Enzyme Inhibition Constant Data from BindingDB
Found 1 hit for monomerid = 50387724
TargetNatural resistance-associated macrophage protein 1(Homo sapiens (Human))
Xenon Pharmaceuticals
Curated by ChEMBL
LigandPNGBDBM50387724(CHEMBL2058876)
Affinity DataIC50: >1.00E+4nM. Assay description: Inhibition of NRAMP1 expressed in CHO cells
In DepthDetails ArticlePubMed