BDBM50387731 CHEMBL2058883
SMILES NC(=N)SCc1cccc2C(=O)c3cccc(CSC(N)=N)c3-c12
InChI Key InChIKey=FNXISSGFJKJMKY-UHFFFAOYSA-N
Data  1 IC50
  Tab Delimited (TSV)   2D SDfile   Computed 3D by Vconf -m prep SDfile
Find this compound or compounds like it in BindingDB:
Activity Spreadsheet -- Enzyme Inhibition Constant Data from BindingDB
Found 1 hit for monomerid = 50387731
TargetNatural resistance-associated macrophage protein 1(Homo sapiens (Human))
Xenon Pharmaceuticals
Curated by ChEMBL
LigandPNGBDBM50387731(CHEMBL2058883)
Affinity DataIC50: >1.00E+4nM. Assay description: Inhibition of NRAMP1 expressed in CHO cells
In DepthDetails ArticlePubMed