BDBM50394178 CHEMBL2158845
SMILES NS(=O)(=O)c1cccc(Nc2nccc(n2)-c2ccnc(c2)N2CCOCC2)c1
InChI Key InChIKey=SUIVLXMKJVEBQK-UHFFFAOYSA-N
Data  4 IC50
  Tab Delimited (TSV)   2D SDfile   Computed 3D by Vconf -m prep SDfile
Find this compound or compounds like it in BindingDB:
Activity Spreadsheet -- Enzyme Inhibition Constant Data from BindingDB
Found 4 hits for monomerid = 50394178
TargetCyclin-dependent kinase 1(Homo sapiens (Human))
Pfizer
Curated by ChEMBL
LigandPNGBDBM50394178(CHEMBL2158845)
Affinity DataIC50:  55nM. Assay description: Inhibition of CDK1
In DepthDetails ArticlePubMed
TargetSerine/threonine-protein kinase mTOR(Homo sapiens (Human))
Pfizer
Curated by ChEMBL
LigandPNGBDBM50394178(CHEMBL2158845)
Affinity DataIC50:  610nM. Assay description: Inhibition of mTOR
In DepthDetails ArticlePubMed
TargetSerine/threonine-protein kinase SMG1(Homo sapiens (Human))
Pfizer
Curated by ChEMBL
LigandPNGBDBM50394178(CHEMBL2158845)
Affinity DataIC50:  11nM. Assay description: Inhibition of human recombinant SMG1 expressed in HEK293 cells using GST-tagged p53 as substrate after 1 hr by DELFIA assay
In DepthDetails ArticlePubMed
TargetCyclin-dependent kinase 2(Homo sapiens (Human))
Pfizer
Curated by ChEMBL
LigandPNGBDBM50394178(CHEMBL2158845)
Affinity DataIC50:  19nM. Assay description: Inhibition of CDK2
In DepthDetails ArticlePubMed