BDBM50396737 CHEMBL2172248
SMILES Cc1cc(Nc2cc(ccc2C)C(O)=O)nc(C)n1
InChI Key InChIKey=ADVCNTXYIOLPAF-UHFFFAOYSA-N
Data  1 KI
  Tab Delimited (TSV)   2D SDfile   Computed 3D by Vconf -m prep SDfile
Find this compound or compounds like it in BindingDB:
Activity Spreadsheet -- Enzyme Inhibition Constant Data from BindingDB
Found 1 hit for monomerid = 50396737
TargetAldo-keto reductase family 1 member C3(Homo sapiens (Human))
University Of Ljubljana
Curated by ChEMBL
LigandPNGBDBM50396737(CHEMBL2172248)
Affinity DataKi:  1.44E+5nM. Assay description: Inhibition of human recombinant AKR1C3 assessed as 1-acenaphthenol oxidation by spectrophotometry
In DepthDetails ArticlePubMed