BDBM50396743 CHEMBL2172255
SMILES OC(=O)CNC=C1C(=O)CC(CC1=O)c1ccccc1
InChI Key InChIKey=IYVQEMNZLUBXEK-WQLSENKSSA-N
Data  2 KI
  Tab Delimited (TSV)   2D SDfile   Computed 3D by Vconf -m prep SDfile
Find this compound or compounds like it in BindingDB:
Activity Spreadsheet -- Enzyme Inhibition Constant Data from BindingDB
Found 2 hits for monomerid = 50396743
TargetAldo-keto reductase family 1 member C2(Homo sapiens (Human))
University Of Ljubljana
Curated by ChEMBL
LigandPNGBDBM50396743(CHEMBL2172255)
Affinity DataKi:  1.82E+4nM. Assay description: Inhibition of human recombinant AKR1C2 assessed as 1-acenaphthenol oxidation by spectrophotometry
In DepthDetails ArticlePubMed
TargetAldo-keto reductase family 1 member C1(Homo sapiens (Human))
University Of Ljubljana
Curated by ChEMBL
LigandPNGBDBM50396743(CHEMBL2172255)
Affinity DataKi:  5.60E+4nM. Assay description: Inhibition of human recombinant AKR1C1 assessed as 1-acenaphthenol oxidation by spectrophotometry
In DepthDetails ArticlePubMed