BDBM50398195 CHEMBL2177238
SMILES CN1C(=O)N(C(=O)[C@@]1(C)c1ccc(O)cc1)c1ccc(C#N)c(c1)C(F)(F)F
InChI Key InChIKey=IHPVXUVRRPAUIQ-GOSISDBHSA-N
Data  2 IC50  1 EC50
PDB links: 1 PDB ID matches this monomer.
  Tab Delimited (TSV)   2D SDfile   Computed 3D by Vconf -m prep SDfile
Find this compound or compounds like it in BindingDB:
Activity Spreadsheet -- Enzyme Inhibition Constant Data from BindingDB
Found 3 hits for monomerid = 50398195
TargetProgesterone receptor(Homo sapiens (Human))
Galapagos, Parc Biocitech
Curated by ChEMBL
LigandPNGBDBM50398195(CHEMBL2177238)
Affinity DataIC50:  8.80E+3nM. Assay description: Binding affinity to progesterone receptor by competitive binding assay
In DepthDetails ArticlePubMed
TargetAndrogen receptor(Homo sapiens (Human))
China Pharmaceutical University
Curated by ChEMBL
LigandPNGBDBM50398195(CHEMBL2177238)
Affinity DataEC50:  0.900nM. Assay description: Modulation of Androgen receptor (unknown origin)
TargetAndrogen receptor(Homo sapiens (Human))
China Pharmaceutical University
Curated by ChEMBL
LigandPNGBDBM50398195(CHEMBL2177238)
Affinity DataIC50:  9.60nM. Assay description: Binding affinity to androgen receptor by competitive binding assay