BDBM50398452 CHEMBL2179110
SMILES CCC#CCO[C@@H]1C[C@H]2[C@@H]3CCC(=O)[C@@]3(C)CC[C@@H]2[C@@]2(C)C=CC(=O)C=C12
InChI Key InChIKey=VZGAHAQWKVTWEF-RAPVPNNWSA-N
Data  3 IC50
PDB links: 1 PDB ID matches this monomer.
  Tab Delimited (TSV)   2D SDfile   Computed 3D by Vconf -m prep SDfile
Find this compound or compounds like it in BindingDB:
Activity Spreadsheet -- Enzyme Inhibition Constant Data from BindingDB
Found 3 hits for monomerid = 50398452
TargetAromatase(Homo sapiens (Human))
American University Of Ras Al Khaimah
Curated by ChEMBL
LigandPNGBDBM50398452(CHEMBL2179110)
Affinity DataIC50:  12nM. Assay description: Inhibition of aromatase (unknown origin)
TargetAromatase(Homo sapiens (Human))
American University Of Ras Al Khaimah
Curated by ChEMBL
LigandPNGBDBM50398452(CHEMBL2179110)
Affinity DataIC50:  12nM. Assay description: Inhibition of aromatase in human JEG-3 cells using Androst-4-ene-3,17-dione as substrate incubated for 1 hr and measured by BCA assay
TargetAromatase(Homo sapiens (Human))
American University Of Ras Al Khaimah
Curated by ChEMBL
LigandPNGBDBM50398452(CHEMBL2179110)
Affinity DataIC50:  11.8nM. Assay description: Inhibition of human placental aromatase using [3H]-1beta-androstenedione as substrate after 16 hrs by [3H]-water method