BDBM50402572 CHEMBL2205559
SMILES CCCCc1sc(nc1-c1ccc(Oc2ccc(Cl)cc2)cc1)-c1ccc(OCC2CCCN(CC)C2)cc1
InChI Key InChIKey=WROFIVGZFHZPEZ-UHFFFAOYSA-N
Data  1 IC50
  Tab Delimited (TSV)   2D SDfile   Computed 3D by Vconf -m prep SDfile
Find this compound or compounds like it in BindingDB:
Activity Spreadsheet -- Enzyme Inhibition Constant Data from BindingDB
Found 1 hit for monomerid = 50402572
TargetAdvanced glycosylation end product-specific receptor(Homo sapiens (Human))
Korea Institute Of Science And Technology
Curated by ChEMBL
LigandPNGBDBM50402572(CHEMBL2205559)
Affinity DataIC50:  660nM. Assay description: Antagonist activity at human biotinylated RAGE assessed as inhibition of amyloid beta binding after 60 mins by ELISA
In DepthDetails ArticlePubMed