BDBM50403586 CHEMBL97331
SMILES OC(=O)C(Oc1cc(OC(C(O)=O)P(O)(O)=O)cc(c1)C(O)=O)C(O)=O
InChI Key InChIKey=FAKOXXUOHIZFQH-UHFFFAOYSA-N
Data  1 KI
  Tab Delimited (TSV)   2D SDfile   Computed 3D by Vconf -m prep SDfile
Find this compound or compounds like it in BindingDB:
Activity Spreadsheet -- Enzyme Inhibition Constant Data from BindingDB
Found 1 hit for monomerid = 50403586
Target3-phosphoshikimate 1-carboxyvinyltransferase(Escherichia coli (strain K12))
TBA
Curated by ChEMBL
LigandPNGBDBM50403586(CHEMBL97331)
Affinity DataKi:  1.30E+3nM. Assay description: Compound was tested for inhibitory activity against EPSP(5-enolpyruvylshikimate 3-phosphate) synthase in Escherichia coli.
In DepthDetails Article