BDBM50403850 CHEMBL157454
SMILES COc1ccc(cc1N1CCNCC1)S(=O)(=O)N1CCc2c(Cl)ccc(Cl)c2C1
InChI Key InChIKey=WIGRWVDYGPCQQT-UHFFFAOYSA-N
Data  1 KI
  Tab Delimited (TSV)   2D SDfile   Computed 3D by Vconf -m prep SDfile
Find this compound or compounds like it in BindingDB:
Activity Spreadsheet -- Enzyme Inhibition Constant Data from BindingDB
Found 1 hit for monomerid = 50403850
Target5-hydroxytryptamine receptor 6(Homo sapiens (Human))
Smithkline Beecham Pharmaceuticals
Curated by ChEMBL
LigandPNGBDBM50403850(CHEMBL157454)
Affinity DataKi:  0.501nM. Assay description: Binding affinity against human 5-hydroxytryptamine 6 receptor
In DepthDetails ArticlePubMed