BDBM50404182 CHEMBL25463
SMILES CC1(CC=C)OC(=S)Nc2ccc(cc12)-c1cccc(Cl)c1
InChI Key InChIKey=UXICZAAUDQWRQA-UHFFFAOYSA-N
Data  1 EC50
  Tab Delimited (TSV)   2D SDfile   Computed 3D by Vconf -m prep SDfile
Find this compound or compounds like it in BindingDB:
Activity Spreadsheet -- Enzyme Inhibition Constant Data from BindingDB
Found 1 hit for monomerid = 50404182
TargetProgesterone receptor(Homo sapiens (Human))
Wyeth Research
Curated by ChEMBL
LigandPNGBDBM50404182(CHEMBL25463)
Affinity DataEC50:  0.300nM. Assay description: Effective concentration on alkaline phosphatase activity in human T47D breast carcinoma cell line.
In DepthDetails ArticlePubMed