BDBM50405386 CHEMBL2051764
SMILES CO[C@H]1O[C@H](C)[C@H](N[C@H]2C=C(CO)[C@@H](O)[C@H](O)[C@H]2O)[C@H](O)[C@H]1O
InChI Key InChIKey=KFHKERRGDZTZQJ-UZYNFKIKSA-N
Data  2 IC50
  Tab Delimited (TSV)   2D SDfile   Computed 3D by Vconf -m prep SDfile
Find this compound or compounds like it in BindingDB:
Activity Spreadsheet -- Enzyme Inhibition Constant Data from BindingDB
Found 2 hits for monomerid = 50405386
TargetSucrase-isomaltase, intestinal(Homo sapiens (Human))
TBA
Curated by ChEMBL
LigandPNGBDBM50405386(CHEMBL2051764)
Affinity DataIC50:  6.60E+4nM. Assay description: Alpha-D-glucosidase inhibitory activity and enzyme inhibition in vitro against porcine sucrase
In DepthDetails ArticlePubMed
TargetMaltase-glucoamylase(Homo sapiens (Human))
TBA
Curated by ChEMBL
LigandPNGBDBM50405386(CHEMBL2051764)
Affinity DataIC50:  1.00E+5nM. Assay description: Inhibitory activity against porcine maltase
In DepthDetails ArticlePubMed