BDBM50405728 CHEMBL2115462
SMILES Nc1ncnc2n(cnc12)[C@H]1[C@H](O)[C@H](O)[C@@H](CO)[C@H]1F
InChI Key InChIKey=LFSGVDMIBZBPPJ-QCFOWSJWSA-N
Data  3 IC50
  Tab Delimited (TSV)   2D SDfile   Computed 3D by Vconf -m prep SDfile
Find this compound or compounds like it in BindingDB:
Activity Spreadsheet -- Enzyme Inhibition Constant Data from BindingDB
Found 3 hits for monomerid = 50405728
TargetAdenosylhomocysteinase(Homo sapiens (Human))
Syntex Research
Curated by ChEMBL
LigandPNGBDBM50405728(CHEMBL2115462)
Affinity DataIC50:  8nM. Assay description: Inhibition of S-adenosyl-homocysteine (AdoHcy)hydrolase from rabbit erythrocytes
In DepthDetails ArticlePubMed
TargetAdenosylhomocysteinase(Homo sapiens (Human))
Syntex Research
Curated by ChEMBL
LigandPNGBDBM50405728(CHEMBL2115462)
Affinity DataIC50:  370nM. Assay description: Inhibition of human placental SAH hydrolase expressed in Escherichia coli JM109 using SAH as substrate preincubated for 10 mins followed by SAH addit...
In DepthDetails ArticlePubMed
TargetAdenosylhomocysteinase(Homo sapiens (Human))
Syntex Research
Curated by ChEMBL
LigandPNGBDBM50405728(CHEMBL2115462)
Affinity DataIC50:  370nM. Assay description: Inhibition of human placental SAH hydrolase expressed in Escherichia coli JM109 using SAH as substrate preincubated for 10 mins followed by SAH addit...
In DepthDetails ArticlePubMed