BDBM50406394
SMILES NCCCC[C@H](OP(O)(=O)CCCCc1ccccc1)C(=O)N1C[C@H](C[C@H]1C(O)=O)C1CCCCC1
InChI Key InChIKey=FKYBDZSZSPXNKE-SDHOMARFSA-N
Data  1 IC50
  Tab Delimited (TSV)   2D SDfile   Computed 3D by Vconf -m prep SDfile
Find this compound or compounds like it in BindingDB:
Activity Spreadsheet -- Enzyme Inhibition Constant Data from BindingDB
Found 1 hit for monomerid = 50406394
TargetAngiotensin-converting enzyme(Homo sapiens (Human))
Washington University
Curated by ChEMBL
LigandPNGBDBM50406394
Affinity DataIC50:  0.490nM. Assay description: Inhibitory activity against angiotensin converting enzyme (ACE)
In DepthDetails ArticlePubMed