BDBM50406751 CHEMBL2369941
SMILES [#6]-[#6]-[#6]-[#6]-1-[#6]-[#6@@H](-[#7](-[#6]-1)-[#6](=O)-[#6@H](-[#6]-[#8])-[#7]-[#6](=O)-[#6@H](-[#6]-c1ccsc1)-[#7]-[#6](=O)-[#6]-[#7]-[#6](=O)-[#6@@H]-1-[#6]-[#6]-[#6@H](-[#8])-[#7]-1-[#6](=O)-[#6@@H]-1-[#6]-[#6]-[#6]-[#7]-1-[#6](=O)-[#6@H](-[#6]-[#6]-[#6]\[#7]=[#6](\[#7])-[#7])-[#7]-[#6](=O)-[#6@H](-[#7])-[#6]-[#6]-[#6]\[#7]=[#6](\[#7])-[#7])-[#6](=O)-[#7]-1-[#6@@H](-[#6]-[#6]-2-[#6]-[#6]-[#6]-[#6]-[#6]-1-2)-[#6](=O)-[#7]-[#6@@H](-[#6]-[#6]-[#6]\[#7]=[#6](\[#7])-[#7])-[#6](-[#8])=O
InChI Key InChIKey=RIQHZBCJWSSORO-GHBARMRASA-N
Data  1 KI
  Tab Delimited (TSV)   2D SDfile   Computed 3D by Vconf -m prep SDfile
Find this compound or compounds like it in BindingDB:
Activity Spreadsheet -- Enzyme Inhibition Constant Data from BindingDB
Found 1 hit for monomerid = 50406751
TargetB2 bradykinin receptor(Cavia porcellus)
Scios Nova
Curated by ChEMBL
LigandPNGBDBM50406751(CHEMBL2369941)
Affinity DataKi:  0.160nM. Assay description: In vitro binding affinity against bradykinin receptor B2 from guinea pig ileum.
In DepthDetails ArticlePubMed