BDBM50406899 CHEMBL80384
SMILES OC(=O)[C@H](CS)NC(=O)CS
InChI Key InChIKey=YKAZZRWCNMLLKW-VKHMYHEASA-N
Data  1 IC50
  Tab Delimited (TSV)   2D SDfile   Computed 3D by Vconf -m prep SDfile
Find this compound or compounds like it in BindingDB:
Activity Spreadsheet -- Enzyme Inhibition Constant Data from BindingDB
Found 1 hit for monomerid = 50406899
TargetAngiotensin-converting enzyme(Homo sapiens (Human))
Washington University
Curated by ChEMBL
LigandPNGBDBM50406899(CHEMBL80384)
Affinity DataIC50:  1.91E+4nM. Assay description: Inhibitory activity against angiotensin converting enzyme (ACE)
In DepthDetails ArticlePubMed