BDBM50406909 CHEMBL80779
SMILES C[C@H](NC(CCc1cccc2ccccc12)C(O)=O)C(=O)N1CCC[C@H]1C(O)=O
InChI Key InChIKey=CTHFSMGTKMPAKM-CJESRSHOSA-N
Data  2 IC50
  Tab Delimited (TSV)   2D SDfile   Computed 3D by Vconf -m prep SDfile
Find this compound or compounds like it in BindingDB:
Activity Spreadsheet -- Enzyme Inhibition Constant Data from BindingDB
Found 2 hits for monomerid = 50406909
TargetAngiotensin-converting enzyme(Homo sapiens (Human))
University Of Michigan
Curated by ChEMBL
LigandPNGBDBM50406909(CHEMBL80779)
Affinity DataIC50:  3.16nM. Assay description: Inhibition of angiotensin I converting enzyme in silico
In DepthDetails ArticlePubMed
TargetAngiotensin-converting enzyme(Homo sapiens (Human))
University Of Michigan
Curated by ChEMBL
LigandPNGBDBM50406909(CHEMBL80779)
Affinity DataIC50:  1.10nM. Assay description: Inhibitory activity against angiotensin converting enzyme (ACE)
In DepthDetails ArticlePubMed