BDBM50407726 CHEMBL174107
SMILES CSc1ccc(cc1)N1C(N)=NC(N)=NC1(C)C
InChI Key InChIKey=GYXWUBHCYWWAOK-UHFFFAOYSA-N
Data  1 KI
  Tab Delimited (TSV)   2D SDfile   Computed 3D by Vconf -m prep SDfile
Find this compound or compounds like it in BindingDB:
Activity Spreadsheet -- Enzyme Inhibition Constant Data from BindingDB
Found 1 hit for monomerid = 50407726
TargetDihydrofolate reductase(Pneumocystis carinii)
Cor Therapeutics
Curated by ChEMBL
LigandPNGBDBM50407726(CHEMBL174107)
Affinity DataKi:  251nM. Assay description: Inhibition of dihydrofolate reductase (DHFR) from Pneumocystis carinii.
In DepthDetails ArticlePubMed