BDBM50412191 CHEMBL1162490::Latifolicinin C Acid::p-Hydroxyphenyl lactic acid, L-
SMILES O[C@@H](Cc1ccc(O)cc1)C(O)=O
InChI Key InChIKey=JVGVDSSUAVXRDY-QMMMGPOBSA-N
Data  2 KI
PDB links: 5 PDB IDs match this monomer.
  Tab Delimited (TSV)   2D SDfile   Computed 3D by Vconf -m prep SDfile
Find this compound or compounds like it in BindingDB:
Activity Spreadsheet -- Enzyme Inhibition Constant Data from BindingDB
Found 2 hits for monomerid = 50412191
TargetSolute carrier family 22 member 20(Mus musculus)
University Of California
Curated by ChEMBL
LigandPNGBDBM50412191(CHEMBL1162490 | Latifolicinin C Acid | p-Hydroxyph...)
Affinity DataKi:  1.82E+5nM. Assay description: Inhibition of mouse Oat6-mediated [3H]ES uptake in Xenopus oocytes after 1 hr
In DepthDetails ArticlePubMed
TargetSolute carrier family 22 member 6(Mus musculus)
University Of California
Curated by ChEMBL
LigandPNGBDBM50412191(CHEMBL1162490 | Latifolicinin C Acid | p-Hydroxyph...)
Affinity DataKi:  2.24E+5nM. Assay description: Inhibition of mouse Oat1-mediated [3H]PAH uptake in Xenopus oocytes after 1 hr
In DepthDetails ArticlePubMed