BDBM50412711 CHEMBL459723
SMILES CC(=NNC(=O)[C@H]1[C@@H](CNC1=O)c1cccc(Br)c1)c1cccc(Br)c1
InChI Key InChIKey=NBAVZVQWZAYJHS-IRXDYDNUSA-N
Data  1 EC50
  Tab Delimited (TSV)   2D SDfile   Computed 3D by Vconf -m prep SDfile
Find this compound or compounds like it in BindingDB:
Activity Spreadsheet -- Enzyme Inhibition Constant Data from BindingDB
Found 1 hit for monomerid = 50412711
TargetProteinase-activated receptor 2(Homo sapiens (Human))
Acadia Pharmaceuticals
Curated by ChEMBL
LigandPNGBDBM50412711(CHEMBL459723)
Affinity DataEC50:  25.1nM. Assay description: Agonist activity at human PAR2 expressed in HEK293T cells assessed as effect on intracellular calcium mobilization by R-SAT assay
In DepthDetails ArticlePubMed